BDBM50433813 CHEMBL2382330
SMILES COc1cc(cc(OC)c1OC)N(C)c1cnc2nc(N)nc(N)c2c1
InChI Key InChIKey=LXUURPGAYDBQPD-UHFFFAOYSA-N
Data  1 IC50
  Tab Delimited (TSV)   2D SDfile   Computed 3D by Vconf -m prep SDfile
Find this compound or compounds like it in BindingDB:
Activity Spreadsheet -- Enzyme Inhibition Constant Data from BindingDB
Found 1 hit for monomerid = 50433813
TargetDihydrofolate reductase(Homo sapiens (Human))
Duquesne University
Curated by ChEMBL
LigandPNGBDBM50433813(CHEMBL2382330)
Affinity DataIC50:  4.60nM. Assay description: Inhibition of human recombinant DHFR
In DepthDetails ArticlePubMed