BDBM50433822 CHEMBL2382321
SMILES Nc1nc(N)c2cc(Nc3ccc4ccccc4c3)cnc2n1
InChI Key InChIKey=CACNBTSCHPWYIF-UHFFFAOYSA-N
Data  2 IC50
  Tab Delimited (TSV)   2D SDfile   Computed 3D by Vconf -m prep SDfile
Find this compound or compounds like it in BindingDB:
Activity Spreadsheet -- Enzyme Inhibition Constant Data from BindingDB
Found 2 hits for monomerid = 50433822
TargetDihydrofolate reductase(Homo sapiens (Human))
Duquesne University
Curated by ChEMBL
LigandPNGBDBM50433822(CHEMBL2382321)
Affinity DataIC50:  2.20E+3nM. Assay description: Inhibition of recombinant human DHFR assessed as reduction in consumption of NADPH using 18 uM DHFA as substrate
In DepthDetails ArticlePubMed
TargetDihydrofolate reductase(Homo sapiens (Human))
Duquesne University
Curated by ChEMBL
LigandPNGBDBM50433822(CHEMBL2382321)
Affinity DataIC50:  2.20E+3nM. Assay description: Inhibition of human recombinant DHFR
In DepthDetails ArticlePubMed