BDBM50434785 CHEMBL2386637
SMILES OCc1nc2cnc3[nH]ccc3c2n1C1CCCCC1
InChI Key InChIKey=HMJUPPDIEBZXPQ-UHFFFAOYSA-N
Data  2 KI  3 EC50
  Tab Delimited (TSV)   2D SDfile   Computed 3D by Vconf -m prep SDfile
Find this compound or compounds like it in BindingDB:
Activity Spreadsheet -- Enzyme Inhibition Constant Data from BindingDB
Found 5 hits for monomerid = 50434785
TargetTyrosine-protein kinase JAK1(Homo sapiens (Human))
Genentech
Curated by ChEMBL
LigandPNGBDBM50434785(CHEMBL2386637)
Affinity DataKi:  1.10nM. Assay description: Inhibition of recombinant JAK1 (unknown origin) using Val-Ala-Leu-Val-Asp-Gly-Tyr-Phe-Arg-Leu-Thr-Thr as substrate after 30 mins in presence of ATP
In DepthDetails ArticlePubMed
TargetTyrosine-protein kinase JAK2(Homo sapiens (Human))
Genentech
Curated by ChEMBL
LigandPNGBDBM50434785(CHEMBL2386637)
Affinity DataKi:  8.30nM. Assay description: Inhibition of recombinant JAK2 (unknown origin) using Val-Ala-Leu-Val-Asp-Gly-Tyr-Phe-Arg-Leu-Thr-Thr as substrate after 30 mins in presence of ATP
In DepthDetails ArticlePubMed
TargetTyrosine-protein kinase JAK1(Homo sapiens (Human))
Genentech
Curated by ChEMBL
LigandPNGBDBM50434785(CHEMBL2386637)
Affinity DataEC50:  64nM. Assay description: Inhibition of JAK1 in human TF1 cells assessed as inhibition of IL6-induced STAT3 phosphorylation incubated for 20 mins followed by IL6 challenge for...
In DepthDetails ArticlePubMed
TargetTyrosine-protein kinase JAK1(Homo sapiens (Human))
Genentech
Curated by ChEMBL
LigandPNGBDBM50434785(CHEMBL2386637)
Affinity DataEC50:  313nM. Assay description: Inhibition of JAK1 in human TF1 cells assessed as inhibition of IL6-induced STAT3 phosphorylation incubated for 20 mins followed by IL6 challenge for...
In DepthDetails ArticlePubMed
TargetTyrosine-protein kinase JAK2(Homo sapiens (Human))
Genentech
Curated by ChEMBL
LigandPNGBDBM50434785(CHEMBL2386637)
Affinity DataEC50:  730nM. Assay description: Inhibition of JAK2 in human TF1 cells assessed as inhibition of EPO-induced STAT5 phosphorylation incubated for 20 mins followed by IL6 challenge for...
In DepthDetails ArticlePubMed