BDBM50434906 CHEMBL2385220
SMILES CC(C(=O)NCc1ccc(nc1OCCC1CCCCN1C(=O)OC(C)(C)C)C(F)(F)F)c1ccc(NS(C)(=O)=O)c(F)c1
InChI Key InChIKey=RXHMBUWWKUMPRB-UHFFFAOYSA-N
Data  1 KI  1 IC50
  Tab Delimited (TSV)   2D SDfile   Computed 3D by Vconf -m prep SDfile
Find this compound or compounds like it in BindingDB:
Activity Spreadsheet -- Enzyme Inhibition Constant Data from BindingDB
Found 2 hits for monomerid = 50434906
TargetTransient receptor potential cation channel subfamily V member 1(Homo sapiens (Human))
Seoul National University
Curated by ChEMBL
LigandPNGBDBM50434906(CHEMBL2385220)
Affinity DataKi:  0.300nM. Assay description: Antagonist activity at human TRPV1 expressed in CHOK1 cells assessed as inhibition of capsaicin-induced activity by FLIPR assay
In DepthDetails ArticlePubMed
TargetTransient receptor potential cation channel subfamily V member 1(Homo sapiens (Human))
Seoul National University
Curated by ChEMBL
LigandPNGBDBM50434906(CHEMBL2385220)
Affinity DataIC50:  17nMpH: 6.0Assay Description:Antagonist activity at human TRPV1 expressed in CHOK1 cells assessed as inhibition of pH 6 to 6.3-induced activity by FLIPR assay
In DepthDetails ArticlePubMed