BDBM50435999 CHEMBL2392182
SMILES COc1ccc(nc1)C(=O)Nc1cc(Br)cc2c1oc(cc2=O)C(O)=O
InChI Key InChIKey=HUCLWZDRJIRCBM-UHFFFAOYSA-N
Data  1 KI  1 IC50  2 EC50
  Tab Delimited (TSV)   2D SDfile   Computed 3D by Vconf -m prep SDfile
Find this compound or compounds like it in BindingDB:
Activity Spreadsheet -- Enzyme Inhibition Constant Data from BindingDB
Found 4 hits for monomerid = 50435999
TargetG-protein coupled receptor 35(Homo sapiens (Human))
University Of Bonn
Curated by ChEMBL
LigandPNGBDBM50435999(CHEMBL2392182)
Affinity DataKi:  57nM. Assay description: Displacement of [3H]PSB-13253 from human recombinant GPR35 exprssed in CHO cells by liquid scintillation counting analysisChecked by Author
In DepthDetails ArticlePubMed
TargetG protein-coupled receptor GPR35(Rattus norvegicus)
University Of Bonn
Curated by ChEMBL
LigandPNGBDBM50435999(CHEMBL2392182)
Affinity DataEC50:  1.54E+3nM. Assay description: Agonist activity at rat GPR35 expressed in CHO cells assessed as induction of beta-arrestin recruitment after 90 mins by beta-galactosidase reporter ...
In DepthDetails ArticlePubMed
TargetG-protein coupled receptor 35(Homo sapiens (Human))
University Of Bonn
Curated by ChEMBL
LigandPNGBDBM50435999(CHEMBL2392182)
Affinity DataEC50:  144nM. Assay description: Agonist activity at human GPR35 expressed in CHO cells assessed as induction of beta-arrestin recruitment after 90 mins by beta-galactosidase reporte...
In DepthDetails ArticlePubMed
TargetG-protein coupled receptor 55(Homo sapiens (Human))
University Of Bonn
Curated by ChEMBL
LigandPNGBDBM50435999(CHEMBL2392182)
Affinity DataIC50:  8.92E+3nM. Assay description: Antagonist activity at human GPR55 expressed in CHO cells assessed as inhibition of lysophosphotidylinositol-induced beta-arrestin recruitment preinc...
In DepthDetails ArticlePubMed