BDBM50436870 CHEMBL2403829
SMILES COCCN1CCC(CC1)c1cc(OC(C)C)c(Nc2ncc(C)c(Nc3ccccc3S(=O)(=O)C(C)C)n2)cc1C
InChI Key InChIKey=UYBILPBKQDAXTL-UHFFFAOYSA-N
Data  2 IC50
  Tab Delimited (TSV)   2D SDfile   Computed 3D by Vconf -m prep SDfile
Find this compound or compounds like it in BindingDB:
Activity Spreadsheet -- Enzyme Inhibition Constant Data from BindingDB
Found 2 hits for monomerid = 50436870
TargetALK tyrosine kinase receptor(Homo sapiens (Human))
Genomics Institute Of The Novartis Research Foundation
Curated by ChEMBL
LigandPNGBDBM50436870(CHEMBL2403829)
Affinity DataIC50:  44nM. Assay description: Inhibition of NPM-fused ALK (unknown origin) expressed in mouse BAF3 cells after 2 to 3 days by luciferase reporter gene assay
In DepthDetails ArticlePubMed
TargetInsulin receptor(Homo sapiens (Human))
Genomics Institute Of The Novartis Research Foundation
Curated by ChEMBL
LigandPNGBDBM50436870(CHEMBL2403829)
Affinity DataIC50:  418nM. Assay description: Inhibition of TEL-fused insulin receptor (unknown origin) expressed in mouse BAF3 cells after 2 to 3 days by luciferase reporter gene assay
In DepthDetails ArticlePubMed