BDBM50436878 CHEMBL2403872
SMILES CN[C@@H](C)C(=O)N[C@@H](C(C)C)C(=O)N[C@@H](CCCNC(N)=N[N+]([O-])=O)C(=O)N[C@@H]1CCCc2ccccc12
InChI Key InChIKey=VCKNDEAQNFVJQO-CZGNIMDHSA-N
Data  2 KI
  Tab Delimited (TSV)   2D SDfile   Computed 3D by Vconf -m prep SDfile
Find this compound or compounds like it in BindingDB:
Activity Spreadsheet -- Enzyme Inhibition Constant Data from BindingDB
Found 2 hits for monomerid = 50436878
TargetE3 ubiquitin-protein ligase XIAP(Homo sapiens (Human))
Sanford-Burnham Medical Research Institute
Curated by ChEMBL
LigandPNGBDBM50436878(CHEMBL2403872)
Affinity DataKi:  290nM. Assay description: Competitive inhibition of XIAP-BIR3 domain (unknown origin) by fluorescence polarization assay
In DepthDetails ArticlePubMed
TargetE3 ubiquitin-protein ligase XIAP(Homo sapiens (Human))
Sanford-Burnham Medical Research Institute
Curated by ChEMBL
LigandPNGBDBM50436878(CHEMBL2403872)
Affinity DataKi:  3.51E+3nM. Assay description: Competitive inhibition of XIAP-BIR2 domain (unknown origin) by fluorescence polarization assay
In DepthDetails ArticlePubMed