BDBM50437373 CHEMBL2408471
SMILES OC(=O)[C@H]1CC[C@@H](CC1)Oc1ccc(cn1)-c1ccc(cn1)-c1nc2ccc(F)cc2[nH]1
InChI Key InChIKey=DRKWYKUERIXOGE-PPUGGXLSSA-N
Data  3 IC50
  Tab Delimited (TSV)   2D SDfile   Computed 3D by Vconf -m prep SDfile
Find this compound or compounds like it in BindingDB:
Activity Spreadsheet -- Enzyme Inhibition Constant Data from BindingDB
Found 3 hits for monomerid = 50437373
TargetDiacylglycerol O-acyltransferase 1(Mus musculus (mouse))
Merck Research Laboratories
Curated by ChEMBL
LigandPNGBDBM50437373(CHEMBL2408471)
Affinity DataIC50:  8.10nM. Assay description: Inhibition of mouse DGAT1
In DepthDetails ArticlePubMed
TargetDiacylglycerol O-acyltransferase 1(Homo sapiens (Human))
Merck Research Laboratories
Curated by ChEMBL
LigandPNGBDBM50437373(CHEMBL2408471)
Affinity DataIC50: >1.00E+4nM. Assay description: Inhibition of human ACAT1
In DepthDetails ArticlePubMed
TargetDiacylglycerol O-acyltransferase 1(Homo sapiens (Human))
Merck Research Laboratories
Curated by ChEMBL
LigandPNGBDBM50437373(CHEMBL2408471)
Affinity DataIC50:  2.5nM. Assay description: Inhibition of human DGAT1
In DepthDetails ArticlePubMed