BDBM50437384 CHEMBL2408622
SMILES OC(=O)[C@H]1CC[C@@H](CC1)Oc1ccc(cn1)-c1ccc(cn1)-c1nc2ccc(cc2[nH]1)C#N
InChI Key InChIKey=FRYMKINSHNJDKD-RUCARUNLSA-N
Data  3 IC50
  Tab Delimited (TSV)   2D SDfile   Computed 3D by Vconf -m prep SDfile
Find this compound or compounds like it in BindingDB:
Activity Spreadsheet -- Enzyme Inhibition Constant Data from BindingDB
Found 3 hits for monomerid = 50437384
TargetDiacylglycerol O-acyltransferase 1(Mus musculus (mouse))
Merck Research Laboratories
Curated by ChEMBL
LigandPNGBDBM50437384(CHEMBL2408622)
Affinity DataIC50:  96nM. Assay description: Inhibition of mouse DGAT1
In DepthDetails ArticlePubMed
TargetDiacylglycerol O-acyltransferase 1(Homo sapiens (Human))
Merck Research Laboratories
Curated by ChEMBL
LigandPNGBDBM50437384(CHEMBL2408622)
Affinity DataIC50:  6nM. Assay description: Inhibition of human DGAT1
In DepthDetails ArticlePubMed
TargetDiacylglycerol O-acyltransferase 1(Homo sapiens (Human))
Merck Research Laboratories
Curated by ChEMBL
LigandPNGBDBM50437384(CHEMBL2408622)
Affinity DataIC50: >1.00E+4nM. Assay description: Inhibition of human ACAT1
In DepthDetails ArticlePubMed