BDBM50437446 CHEMBL2409341
SMILES O[C@H]1CNC[C@@H](O)[C@@H](O)[C@@H]1O
InChI Key InChIKey=MRFFNLOQLBWKPJ-JGWLITMVSA-N
Data  2 KI
  Tab Delimited (TSV)   2D SDfile   Computed 3D by Vconf -m prep SDfile
Find this compound or compounds like it in BindingDB:
Activity Spreadsheet -- Enzyme Inhibition Constant Data from BindingDB
Found 2 hits for monomerid = 50437446
TargetTissue alpha-L-fucosidase(Bos taurus)
Universit£
Curated by ChEMBL
LigandPNGBDBM50437446(CHEMBL2409341)
Affinity DataKi:  4.60E+3nM. Assay description: Inhibition of bovine kidney alpha-L-fucosidase
In DepthDetails ArticlePubMed
TargetAlpha-galactosidase(Coffea arabica (Coffee beans))
Universit£
Curated by ChEMBL
LigandPNGBDBM50437446(CHEMBL2409341)
Affinity DataKi:  5.40E+4nM. Assay description: Inhibition of coffee bean alpha-galactosidase
In DepthDetails ArticlePubMed