BDBM50437451 CHEMBL2409348
SMILES CC[C@@H]1NC[C@@H](O)[C@@H](O)[C@H](O)[C@H]1O
InChI Key InChIKey=BNRGNNFQQRGBDN-BZCSJUTBSA-N
Data  2 IC50
  Tab Delimited (TSV)   2D SDfile   Computed 3D by Vconf -m prep SDfile
Find this compound or compounds like it in BindingDB:
Activity Spreadsheet -- Enzyme Inhibition Constant Data from BindingDB
Found 2 hits for monomerid = 50437451
TargetLysosomal acid glucosylceramidase(Bos taurus)
Universit£
Curated by ChEMBL
LigandPNGBDBM50437451(CHEMBL2409348)
Affinity DataIC50:  4.87E+5nM. Assay description: Inhibition of bovine liver beta-glucosidase
In DepthDetails ArticlePubMed
TargetBeta-galactosidase(Bos taurus (Bovine))
Universit£
Curated by ChEMBL
LigandPNGBDBM50437451(CHEMBL2409348)
Affinity DataIC50:  5.26E+5nM. Assay description: Inhibition of bovine liver beta-galactosidase
In DepthDetails ArticlePubMed