BDBM50438269 CHEMBL2408381
SMILES OC[C@H]1O[C@H]([C@H](O)[C@@H]1O)n1cc(C(O)=O)c(=O)c2ccc(Br)cc12
InChI Key InChIKey=NGAYUIJOWNVTRB-FMKGYKFTSA-N
Data  2 KI
  Tab Delimited (TSV)   2D SDfile   Computed 3D by Vconf -m prep SDfile
Find this compound or compounds like it in BindingDB:
Activity Spreadsheet -- Enzyme Inhibition Constant Data from BindingDB
Found 2 hits for monomerid = 50438269
TargetGlyceraldehyde-3-phosphate dehydrogenase, glycosomal(Trypanosoma cruzi)
Da Universidade De S£O Paulo
Curated by ChEMBL
LigandPNGBDBM50438269(CHEMBL2408381)
Affinity DataKi:  1.60E+4nM. Assay description: Competitive inhibition of Trypanosoma cruzi glycosomal GAPDH NAD+ binding site by ITC method
In DepthDetails ArticlePubMed
TargetGlyceraldehyde-3-phosphate dehydrogenase, glycosomal(Trypanosoma cruzi)
Da Universidade De S£O Paulo
Curated by ChEMBL
LigandPNGBDBM50438269(CHEMBL2408381)
Affinity DataKi:  1.51E+5nM. Assay description: Non-competitive inhibition of Trypanosoma cruzi glycosomal GAPDH active site by ITC method
In DepthDetails ArticlePubMed