BDBM504387 US11040970, Compound 11-8
SMILES COc1cc2C3CN(C)[C@H](CC(C)(C)C)CN3CCc2cc1OCC1CCC1
InChI Key InChIKey=SSVDACKPVANQIL-YMBRHYMPSA-N
Data  1 KI
  Tab Delimited (TSV)   2D SDfile   Computed 3D by Vconf -m prep SDfile
Find this compound or compounds like it in BindingDB:
Activity Spreadsheet -- Enzyme Inhibition Constant Data from BindingDB
Found 1 hit for monomerid = 504387
TargetSynaptic vesicular amine transporter(Homo sapiens (Human))
Neurocrine Biosciences
US Patent
LigandPNGBDBM504387(US11040970, Compound 11-8)
Affinity DataKi: <10nM. Assay description: In a total volume of 0.15 mL in low-binding 96-well plates (Corning #3605), twelve concentrations of test compound were competed against 10 nM 3H-dih...
Ligand InfoPC cidPC sid
In DepthDetails US Patent