BDBM50438701 CHEMBL2414690
SMILES Cc1ccc(cc1)N1CCOc2ncnc(N)c2C1=O
InChI Key InChIKey=HQQSUDOXVLBEHH-UHFFFAOYSA-N
Data  2 IC50
  Tab Delimited (TSV)   2D SDfile   Computed 3D by Vconf -m prep SDfile
Find this compound or compounds like it in BindingDB:
Activity Spreadsheet -- Enzyme Inhibition Constant Data from BindingDB
Found 2 hits for monomerid = 50438701
TargetDiacylglycerol O-acyltransferase 1(Homo sapiens (Human))
Pfizer
Curated by ChEMBL
LigandPNGBDBM50438701(CHEMBL2414690)
Affinity DataIC50:  681nM. Assay description: Inhibition of DGAT-1-mediated triglyceride synthesis in human HT-29 cells using [3H]-glycerol as substrate incubated for 1 hr prior to substrate addi...
In DepthDetails ArticlePubMed
TargetDiacylglycerol O-acyltransferase 1(Homo sapiens (Human))
Pfizer
Curated by ChEMBL
LigandPNGBDBM50438701(CHEMBL2414690)
Affinity DataIC50:  2.21E+3nM. Assay description: Inhibition of human full length DGAT-1 expressed in insect sf9 cells using [14C]decanoylCoA as substrate after 1.5 hrs by scintillation spectrometry
In DepthDetails ArticlePubMed