BDBM50439587 CHEMBL2418879
SMILES [H][C@@]12CSSC[C@H](NC(=O)[C@H](CO)NC(=O)[C@]([H])(CSSC[C@H](NC(=O)[C@H](CC(O)=O)NC(=O)[C@@H]3CCCN3C(=O)[C@H](CC(C)C)NC(=O)[C@@H]3CCCN3C(=O)[C@@H]3CCCN3)C(=O)N1)NC(=O)[C@@]([H])(NC(=O)[C@H](CCCCN)NC(=O)[C@H](CCC(N)=O)NC(=O)[C@H](CCCNC(N)=N)NC2=O)[C@@H](C)O)C(=O)N[C@@H](CCCNC(N)=N)C(=O)N[C@@H](CC(C)C)C(=O)N[C@@H](Cc1ccc(O)cc1)C(=O)N[C@@H](CCC(O)=O)C(=O)N[C@@H](CC(C)C)C(=O)N[C@@H](CC(C)C)C(=O)N[C@@H](Cc1cnc[nH]1)C(=O)NCC(=O)N[C@@H](C)C(=O)NCC(=O)N[C@@H](CC(N)=O)C(=O)N[C@@H](Cc1cnc[nH]1)C(=O)N[C@@H](C)C(=O)N[C@@H](C)C(=O)NCC(=O)N[C@@H]([C@@H](C)CC)C(=O)N[C@@H](CC(C)C)C(=O)N[C@@H]([C@@H](C)O)C(=O)N[C@@H](CC(C)C)C(N)=O
InChI Key InChIKey=FDBZRMUJWQXURV-JTEVCLSKSA-N
Data  4 EC50
  Tab Delimited (TSV)   2D SDfile   Computed 3D by Vconf -m prep SDfile
Find this compound or compounds like it in BindingDB:
Activity Spreadsheet -- Enzyme Inhibition Constant Data from BindingDB
Found 4 hits for monomerid = 50439587
TargetOrexin receptor type 2(Homo sapiens (Human))
Research Triangle Institute
Curated by ChEMBL
LigandPNGBDBM50439587(CHEMBL2418879)
Affinity DataEC50:  4.20nM. Assay description: Agonist activity at OX2 receptor (unknown origin) expressed in RD-HGA16 cells assessed as calcium mobilization by fluorescence assay
In DepthDetails ArticlePubMed
TargetOrexin/Hypocretin receptor type 1(Homo sapiens (Human))
Research Triangle Institute
Curated by ChEMBL
LigandPNGBDBM50439587(CHEMBL2418879)
Affinity DataEC50:  0.220nM. Assay description: Agonist activity at human OX1 receptor overexpressed in CHO-RD-HGA16 cells assessed as calcium mobilization after 15 mins by fluorescence assay
In DepthDetails ArticlePubMed
TargetOrexin receptor type 2(Homo sapiens (Human))
Research Triangle Institute
Curated by ChEMBL
LigandPNGBDBM50439587(CHEMBL2418879)
Affinity DataEC50:  1.10nM. Assay description: Agonist activity at human OX2 receptor overexpressed in CHO-RD-HGA16 cells assessed as calcium mobilization after 15 mins by fluorescence assay
In DepthDetails ArticlePubMed
TargetOrexin/Hypocretin receptor type 1(Homo sapiens (Human))
Research Triangle Institute
Curated by ChEMBL
LigandPNGBDBM50439587(CHEMBL2418879)
Affinity DataEC50:  0.130nM. Assay description: Agonist activity at OX1 receptor (unknown origin) expressed in RD-HGA16 cells assessed as calcium mobilization by fluorescence assay
In DepthDetails ArticlePubMed