BDBM50440129 CHEMBL2426231
SMILES Nc1nnc(o1)-c1cccc(Br)c1
InChI Key InChIKey=CVVNMXRTDJRCHC-UHFFFAOYSA-N
Data  1 EC50
  Tab Delimited (TSV)   2D SDfile   Computed 3D by Vconf -m prep SDfile
Find this compound or compounds like it in BindingDB:
Activity Spreadsheet -- Enzyme Inhibition Constant Data from BindingDB
Found 1 hit for monomerid = 50440129
TargetVirulence factor transcriptional regulator MvfR(Pseudomonas aeruginosa PA14)
Helmholtz-Institute For Pharmaceutical Research Saarland
Curated by ChEMBL
LigandPNGBDBM50440129(CHEMBL2426231)
Affinity DataEC50:  7.50E+3nM. Assay description: Antagonist activity at Pseudomonas aeruginosa PA14 PqsR expressed in Eschericia coli DH5-alpha assessed as inhibition of PQS-induced protein activati...
In DepthDetails ArticlePubMed