BDBM50440388 CHEMBL2425366
SMILES C1CNCc2ccc3nc4c(ccc5cc6cc(CNCCNCCNCc7ccc8nc9c(ccc%10cc%11cc(CNCCN1)ccc%11nc9%10)cc8c7)ccc6nc45)cc3c2
InChI Key InChIKey=VAUSMGHXWKWHEM-UHFFFAOYSA-N
Data  1 IC50
  Tab Delimited (TSV)   2D SDfile   Computed 3D by Vconf -m prep SDfile
Find this compound or compounds like it in BindingDB:
Activity Spreadsheet -- Enzyme Inhibition Constant Data from BindingDB
Found 1 hit for monomerid = 50440388
TargetTelomerase reverse transcriptase(Homo sapiens (Human))
Universit£
Curated by ChEMBL
LigandPNGBDBM50440388(CHEMBL2425366)
Affinity DataIC50:  130nM. Assay description: Inhibition of telomerase (unknown origin) by TRAP assay
In DepthDetails ArticlePubMed