BDBM50440732 CHEMBL2431084
SMILES Cc1noc2[C@H](CC(N)=O)N=C(Cc3ccccc3)c3c(C)c(C)sc3-c12
InChI Key InChIKey=KGVGAGNNCQMVOM-INIZCTEOSA-N
Data  1 IC50
  Tab Delimited (TSV)   2D SDfile   Computed 3D by Vconf -m prep SDfile
Find this compound or compounds like it in BindingDB:
Activity Spreadsheet -- Enzyme Inhibition Constant Data from BindingDB
Found 1 hit for monomerid = 50440732
TargetBromodomain-containing protein 4(Homo sapiens (Human))
Constellation Pharmaceuticals
Curated by ChEMBL
LigandPNGBDBM50440732(CHEMBL2431084)
Affinity DataIC50:  5.70E+3nM. Assay description: Inhibition of His-FLAG-tagged BRD4 binding domain1 (unknown origin) binding to H4-TetraAc-biotin peptide after 20 mins by AlphaLISA
In DepthDetails ArticlePubMed