BDBM50440734 CHEMBL2431082
SMILES Cc1noc2[C@H](CC(N)=O)N=C(c3c(C)c(C)sc3-c12)c1ccc(N)nc1
InChI Key InChIKey=SOOYKPKJBIMQGU-LBPRGKRZSA-N
Data  2 IC50
  Tab Delimited (TSV)   2D SDfile   Computed 3D by Vconf -m prep SDfile
Find this compound or compounds like it in BindingDB:
Activity Spreadsheet -- Enzyme Inhibition Constant Data from BindingDB
Found 2 hits for monomerid = 50440734
TargetBromodomain-containing protein 4(Homo sapiens (Human))
Constellation Pharmaceuticals
Curated by ChEMBL
LigandPNGBDBM50440734(CHEMBL2431082)
Affinity DataIC50:  380nM. Assay description: Inhibition of BRD4 in human Raji cells assessed as reduction of MYC expression after 4 hrs
In DepthDetails ArticlePubMed
TargetBromodomain-containing protein 4(Homo sapiens (Human))
Constellation Pharmaceuticals
Curated by ChEMBL
LigandPNGBDBM50440734(CHEMBL2431082)
Affinity DataIC50:  73nM. Assay description: Inhibition of His-FLAG-tagged BRD4 binding domain1 (unknown origin) binding to H4-TetraAc-biotin peptide after 20 mins by AlphaLISA
In DepthDetails ArticlePubMed