BDBM50441143 CHEMBL2430855
SMILES Cc1csc(Nc2ncc(C)cc2OCc2ccccc2)n1
InChI Key InChIKey=QFOFZZJJRFMLKB-UHFFFAOYSA-N
Data  1 EC50
PDB links: 1 PDB ID matches this monomer.
  Tab Delimited (TSV)   2D SDfile   Computed 3D by Vconf -m prep SDfile
Find this compound or compounds like it in BindingDB:
Activity Spreadsheet -- Enzyme Inhibition Constant Data from BindingDB
Found 1 hit for monomerid = 50441143
TargetHexokinase-4(Homo sapiens (Human))
Array Biopharma
Curated by ChEMBL
LigandPNGBDBM50441143(CHEMBL2430855)
Affinity DataEC50:  2.64E+3nM. Assay description: Allosteric activation of human glucokinase using glucose as substrate measured every 10 secs for 5 mins