BDBM50441308 CHEMBL2431682
SMILES OP(O)(=O)C(F)(F)c1ccc(cc1)-c1cccc(Nc2ccccc2)c1
InChI Key InChIKey=ZTKAVFLKWSHPEG-UHFFFAOYSA-N
Data  1 KI
  Tab Delimited (TSV)   2D SDfile   Computed 3D by Vconf -m prep SDfile
Find this compound or compounds like it in BindingDB:
Activity Spreadsheet -- Enzyme Inhibition Constant Data from BindingDB
Found 1 hit for monomerid = 50441308
TargetTyrosine-protein phosphatase non-receptor type 5(Homo sapiens (Human))
Yale University
Curated by ChEMBL
LigandPNGBDBM50441308(CHEMBL2431682)
Affinity DataKi:  1.12E+5nM. Assay description: Inhibition of human STEP using pNPP as substrate after 5 mins by spectrophotometric plate reader analysis
In DepthDetails ArticlePubMed