BDBM50441321 CHEMBL2431669
SMILES Oc1c(cccc1-c1cccc(c1)C(F)(F)P(O)(O)=O)C1CCCCCC1
InChI Key InChIKey=KTKQESOFGNESNN-UHFFFAOYSA-N
Data  1 KI
  Tab Delimited (TSV)   2D SDfile   Computed 3D by Vconf -m prep SDfile
Find this compound or compounds like it in BindingDB:
Activity Spreadsheet -- Enzyme Inhibition Constant Data from BindingDB
Found 1 hit for monomerid = 50441321
TargetTyrosine-protein phosphatase non-receptor type 5(Homo sapiens (Human))
Yale University
Curated by ChEMBL
LigandPNGBDBM50441321(CHEMBL2431669)
Affinity DataKi:  6.20E+4nM. Assay description: Inhibition of human STEP using pNPP as substrate after 5 mins by spectrophotometric plate reader analysis
In DepthDetails ArticlePubMed