BDBM50441333 CHEMBL2431696
SMILES Cc1ccc(cc1)-c1cccc(c1)C(F)(F)P(O)(O)=O
InChI Key InChIKey=HSMBBKSDENBGMS-UHFFFAOYSA-N
Data  1 KI
  Tab Delimited (TSV)   2D SDfile   Computed 3D by Vconf -m prep SDfile
Find this compound or compounds like it in BindingDB:
Activity Spreadsheet -- Enzyme Inhibition Constant Data from BindingDB
Found 1 hit for monomerid = 50441333
TargetTyrosine-protein phosphatase non-receptor type 5(Homo sapiens (Human))
Yale University
Curated by ChEMBL
LigandPNGBDBM50441333(CHEMBL2431696)
Affinity DataKi:  2.05E+5nM. Assay description: Inhibition of human STEP using pNPP as substrate after 5 mins by spectrophotometric plate reader analysis
In DepthDetails ArticlePubMed