BDBM504419 2-{5-[(3-Ethoxy-5-fluoropyridin-2-yl)oxy]pyridin-3-yl}-N-[(3R,4S)-4-fluoropiperidin-3-yl]pyrimidine-5-carboxamide, bis(trifluoroacetate) salt ::US11065249, Example 1::US11471458, Example 1::US20230405002, Example 1
SMILES CCOc1cc(F)cnc1Oc1cncc(c1)-c1ncc(cn1)C(=O)N[C@@H]1CNCC[C@@H]1F
InChI Key InChIKey=XZBQFIHUGFHQGB-ZWKOTPCHSA-N
Data  3 IC50
  Tab Delimited (TSV)   2D SDfile   Computed 3D by Vconf -m prep SDfile
Find this compound or compounds like it in BindingDB:
Activity Spreadsheet -- Enzyme Inhibition Constant Data from BindingDB
Found 3 hits for monomerid = 504419
TargetDiacylglycerol O-acyltransferase 2(Homo sapiens (Human))
Pfizer
US Patent
LigandPNGBDBM504419(2-{5-[(3-Ethoxy-5-fluoropyridin-2-yl)oxy]pyridin-3...)
Affinity DataIC50:  5.80nM. Assay description: For determination of IC50 values, the reactions were carried out in 384-well white polypropylene plates (Nunc) in a total volume of 20 μL. To 1 ...
Ligand InfoPC cidPC sid
In DepthDetails US Patent
TargetDiacylglycerol O-acyltransferase 2(Homo sapiens (Human))
Pfizer
US Patent
LigandPNGBDBM504419(2-{5-[(3-Ethoxy-5-fluoropyridin-2-yl)oxy]pyridin-3...)
Affinity DataIC50:  5.80nM. Assay description: For determination of IC50 values, the reactions were carried out in 384-well white polypropylene plates (Nunc) in a total volume of 20 μL. To 1 ...
Ligand InfoPC cidPC sid
In DepthDetails US Patent
TargetDiacylglycerol O-acyltransferase 2(Homo sapiens (Human))
Pfizer
US Patent
LigandPNGBDBM504419(2-{5-[(3-Ethoxy-5-fluoropyridin-2-yl)oxy]pyridin-3...)
Affinity DataIC50:  5.80nM. Assay description: For determination of IC50 values, the reactions were carried out in 384-well white polypropylene plates (Nunc) in a total volume of 20 μL. To 1 ...
Ligand InfoPC cidPC sid
In DepthDetails US Patent