BDBM50442182 CHEMBL2441828
SMILES Cc1[nH]c2cn(-c3ccccc3)c(=O)c2c(c1CN)-c1ccc(Cl)cc1Cl
InChI Key InChIKey=ZECFKNUFLJLNBY-UHFFFAOYSA-N
Data  2 KI
  Tab Delimited (TSV)   2D SDfile   Computed 3D by Vconf -m prep SDfile
Find this compound or compounds like it in BindingDB:
Activity Spreadsheet -- Enzyme Inhibition Constant Data from BindingDB
Found 2 hits for monomerid = 50442182
TargetDipeptidyl peptidase 9(Homo sapiens (Human))
Bristol-Myers Squibb
Curated by ChEMBL
LigandPNGBDBM50442182(CHEMBL2441828)
Affinity DataKi:  3.40nM. Assay description: Inhibition of DPP9 (unknown origin)
In DepthDetails ArticlePubMed
TargetDipeptidyl peptidase 8(Homo sapiens (Human))
Bristol-Myers Squibb
Curated by ChEMBL
LigandPNGBDBM50442182(CHEMBL2441828)
Affinity DataKi:  5.20nM. Assay description: Inhibition of DPP8 (unknown origin)
In DepthDetails ArticlePubMed