BDBM50442568 CHEMBL2440906
SMILES NCCC(=O)NCCNC(=O)CCC(=O)NCCNC(=O)CCC(=O)NCCNC(=O)NC(N)=NCCC[C@@H](NC(=O)C(c1ccccc1)c1ccccc1)C(=O)NCc1ccc(CNC(N)=O)cc1
InChI Key InChIKey=NIVMUHJGOJJMLW-PSXMRANNSA-N
Data  2 KI
  Tab Delimited (TSV)   2D SDfile   Computed 3D by Vconf -m prep SDfile
Find this compound or compounds like it in BindingDB:
Activity Spreadsheet -- Enzyme Inhibition Constant Data from BindingDB
Found 2 hits for monomerid = 50442568
TargetNeuropeptide Y receptor type 1(Homo sapiens (Human))
University Of Regensburg
Curated by ChEMBL
LigandPNGBDBM50442568(CHEMBL2440906)
Affinity DataKi:  1.20E+3nM. Assay description: Displacement of [3H]UR-MK114 from human neuropeptide Y receptor type 1 expressed in human SK-N-MC cells
In DepthDetails ArticlePubMed
TargetNeuropeptide Y receptor type 4(Homo sapiens (Human))
University Of Regensburg
Curated by ChEMBL
LigandPNGBDBM50442568(CHEMBL2440906)
Affinity DataKi: >5.00E+3nM. Assay description: Binding affinity to human neuropeptide Y receptor type 4 receptor expressed in CHO cells using Cy5-[K4]-hPP by flow cytometric analysis
In DepthDetails ArticlePubMed