BDBM50443027 CHEMBL3087794
SMILES CCN(CC)CCNS(=O)(=O)c1cccc(Cl)c1
InChI Key InChIKey=UKJNUXVAABMHNP-UHFFFAOYSA-N
Data  1 IC50  1 Kd
  Tab Delimited (TSV)   2D SDfile   Computed 3D by Vconf -m prep SDfile
Find this compound or compounds like it in BindingDB:
Activity Spreadsheet -- Enzyme Inhibition Constant Data from BindingDB
Found 2 hits for monomerid = 50443027
TargetAcetylcholinesterase(Mus musculus (mouse))
Ume£
Curated by ChEMBL
LigandPNGBDBM50443027(CHEMBL3087794)
Affinity DataIC50:  1.80E+4nM. Assay description: Inhibition of mouse recombinant AChE using acetylthiocholine iodide as substrate by Ellman's method
In DepthDetails ArticlePubMed
TargetAcetylcholinesterase(Mus musculus (mouse))
Ume£
Curated by ChEMBL
LigandPNGBDBM50443027(CHEMBL3087794)
Affinity DataKd:  4.44E+4nM. Assay description: Binding affinity to mouse AChE by isothermal titration calorimetry
In DepthDetails ArticlePubMed