BDBM50443028 CHEMBL3087815
SMILES CCN(CC)CCNS(=O)(=O)c1cccc(c1)C(F)(F)F
InChI Key InChIKey=LCVUXYUASXEIMC-UHFFFAOYSA-N
Data  1 IC50  1 Kd
PDB links: 1 PDB ID matches this monomer.
  Tab Delimited (TSV)   2D SDfile   Computed 3D by Vconf -m prep SDfile
Find this compound or compounds like it in BindingDB:
Activity Spreadsheet -- Enzyme Inhibition Constant Data from BindingDB
Found 2 hits for monomerid = 50443028
TargetAcetylcholinesterase(Mus musculus (mouse))
Ume£
Curated by ChEMBL
LigandPNGBDBM50443028(CHEMBL3087815)
Affinity DataIC50:  2.20E+4nM. Assay description: Inhibition of mouse recombinant AChE using acetylthiocholine iodide as substrate by Ellman's method
TargetAcetylcholinesterase(Mus musculus (mouse))
Ume£
Curated by ChEMBL
LigandPNGBDBM50443028(CHEMBL3087815)
Affinity DataKd:  1.48E+4nM. Assay description: Binding affinity to mouse AChE by isothermal titration calorimetry