BDBM50443184 CHEMBL3086544
SMILES O=C(Nc1nc2ccc(cc2s1)-c1ccncc1)[C@H]1C[C@@H]1c1ccccc1
InChI Key InChIKey=WCIQHQDDKIZJND-MSOLQXFVSA-N
Data  1 KI  1 IC50
  Tab Delimited (TSV)   2D SDfile   Computed 3D by Vconf -m prep SDfile
Find this compound or compounds like it in BindingDB:
Activity Spreadsheet -- Enzyme Inhibition Constant Data from BindingDB
Found 2 hits for monomerid = 50443184
TargetTyrosine-protein kinase ITK/TSK(Homo sapiens (Human))
Evotec (Uk)
Curated by ChEMBL
LigandPNGBDBM50443184(CHEMBL3086544)
Affinity DataKi:  50nM. Assay description: Inhibition of full length GST-tagged ITK (unknown origin) using Ac-EFPIYDFLPAKKK-NH2 as substrate after 35 mins by LC/MS analysis
In DepthDetails ArticlePubMed
TargetTyrosine-protein kinase ITK/TSK(Homo sapiens (Human))
Evotec (Uk)
Curated by ChEMBL
LigandPNGBDBM50443184(CHEMBL3086544)
Affinity DataIC50: >2.00E+4nM. Assay description: Inhibition of ITK in human Jurkat cells assessed as inhibition of PLC-gamma1 phosphorylation by immuno-detection assay
In DepthDetails ArticlePubMed