BDBM50443626 CHEMBL3092451
SMILES Nc1cc2CCCn3c(CCCc4ccccc4)c(c(c1)c23)C(F)(F)F
InChI Key InChIKey=NYYFMHVIESESQY-UHFFFAOYSA-N
Data  2 IC50
  Tab Delimited (TSV)   2D SDfile   Computed 3D by Vconf -m prep SDfile
Find this compound or compounds like it in BindingDB:
Activity Spreadsheet -- Enzyme Inhibition Constant Data from BindingDB
Found 2 hits for monomerid = 50443626
TargetEndothelial lipase(Homo sapiens (Human))
Therachem Research Medilab (India)
Curated by ChEMBL
LigandPNGBDBM50443626(CHEMBL3092451)
Affinity DataIC50:  4nM. Assay description: Inhibition of human endothelial lipase using PLAi as substrate measured for 30 mins by cell-based fluorescence assay
In DepthDetails ArticlePubMed
TargetEndothelial lipase(Mus musculus (Mouse))
Therachem Research Medilab (India)
Curated by ChEMBL
LigandPNGBDBM50443626(CHEMBL3092451)
Affinity DataIC50:  4nM. Assay description: Inhibition of mouse endothelial lipase using PLAi as substrate measured for 30 mins by cell-based fluorescence assay
In DepthDetails ArticlePubMed