BDBM50444606 CHEMBL3099898
SMILES COc1ccc(CNC(=O)c2cc(cnc2-c2cccnc2)-c2cc(F)cc(Cl)c2)cc1OC
InChI Key InChIKey=PAVJJDHZLVSRMX-UHFFFAOYSA-N
Data  2 KI
  Tab Delimited (TSV)   2D SDfile   Computed 3D by Vconf -m prep SDfile
Find this compound or compounds like it in BindingDB:
Activity Spreadsheet -- Enzyme Inhibition Constant Data from BindingDB
Found 2 hits for monomerid = 50444606
TargetOrexin receptor type 2(Homo sapiens (Human))
Merck Research Laboratories
Curated by ChEMBL
LigandPNGBDBM50444606(CHEMBL3099898)
Affinity DataKi:  0.600nM. Assay description: Displacement of [3H]SB-674042 from human orexin-2 receptor after 60 mins by scintillation counting analysis
In DepthDetails ArticlePubMed
TargetOrexin/Hypocretin receptor type 1(Homo sapiens (Human))
Merck Research Laboratories
Curated by ChEMBL
LigandPNGBDBM50444606(CHEMBL3099898)
Affinity DataKi:  1.09E+3nM. Assay description: Displacement of [3H]SB-674042 from human orexin-1 receptor after 60 mins by scintillation counting analysis
In DepthDetails ArticlePubMed