BDBM50444713 CHEMBL3099005
SMILES Cc1cc(N)c2cc(NC(=O)CCc3ccccc3Cl)ccc2n1
InChI Key InChIKey=VFOVZOHRPOQLCC-UHFFFAOYSA-N
Data  2 IC50
  Tab Delimited (TSV)   2D SDfile   Computed 3D by Vconf -m prep SDfile
Find this compound or compounds like it in BindingDB:
Activity Spreadsheet -- Enzyme Inhibition Constant Data from BindingDB
Found 2 hits for monomerid = 50444713
TargetLethal factor(Bacillus anthracis)
Microbiotix
Curated by ChEMBL
LigandPNGBDBM50444713(CHEMBL3099005)
Affinity DataIC50: >1.00E+5nM. Assay description: Inhibition of Bacillus anthracis lethal factor assessed as MCA-KKVYPYPME[dnp]K amide cleavage after 30 mins by fluorescence plate reader analysis
In DepthDetails ArticlePubMed
TargetBotulinum neurotoxin type A(Clostridium botulinum)
Microbiotix
Curated by ChEMBL
LigandPNGBDBM50444713(CHEMBL3099005)
Affinity DataIC50: >1.00E+5nM. Assay description: Inhibition of Clostridium bolulinum BoNT/A assessed as cleavage of MOCAc-Lys-Lys-Val-Tyr-Pro-Tyr-Pro-Met-Glu-Lys(Dnp)-NH2 after 40 mins by FRET assay
In DepthDetails ArticlePubMed