BDBM50444981 CHEMBL3099919
SMILES C[C@@H](N(C\C=C\c1cnc2C[C@]3(Cc2c1)C(=O)Nc1ncccc31)C(=O)C(C)(C)C)c1ccccc1
InChI Key InChIKey=MNNURILBCATYRI-LEAPKJMJSA-N
Data  1 KI
  Tab Delimited (TSV)   2D SDfile   Computed 3D by Vconf -m prep SDfile
Find this compound or compounds like it in BindingDB:
Activity Spreadsheet -- Enzyme Inhibition Constant Data from BindingDB
Found 1 hit for monomerid = 50444981
LigandPNGBDBM50444981(CHEMBL3099919)
Affinity DataKi:  0.220nM. Assay description: Displacement of [125I]-hCGRP from human CALCRL/RAMP1 expressed in HEK293 cell membranes
In DepthDetails ArticlePubMed