BDBM50445752 CHEMBL3104441
SMILES FC(F)(F)Oc1ccc(NC(=O)N2CCOC3(CCN(CC3)C(=O)C3(CC3)c3ccccc3)C2)cc1
InChI Key InChIKey=PDXOHOMNGKKBMN-UHFFFAOYSA-N
Data  2 IC50
  Tab Delimited (TSV)   2D SDfile   Computed 3D by Vconf -m prep SDfile
Find this compound or compounds like it in BindingDB:
Activity Spreadsheet -- Enzyme Inhibition Constant Data from BindingDB
Found 2 hits for monomerid = 50445752
TargetBifunctional epoxide hydrolase 2(Homo sapiens (Human))
Toray Industries
Curated by ChEMBL
LigandPNGBDBM50445752(CHEMBL3104441)
Affinity DataIC50:  0.400nM. Assay description: Inhibition of human recombinant sEH expressed in baculovirus infected insect Sf9 cells using cyano(6-methoxynaphthalen-2-yl)methyl trans-[(3-phenylox...
In DepthDetails ArticlePubMed
TargetBifunctional epoxide hydrolase 2(Rattus norvegicus)
Toray Industries
Curated by ChEMBL
LigandPNGBDBM50445752(CHEMBL3104441)
Affinity DataIC50:  28nM. Assay description: Inhibition of rat recombinant sEH expressed in baculovirus infected insect Sf9 cells using cyano(6-methoxynaphthalen-2-yl)methyl trans-[(3-phenyloxir...
In DepthDetails ArticlePubMed