BDBM50445805 CHEMBL3104774
SMILES CNCCNC(=O)[C@@H](NC(=O)C(C)(C)c1cc(cc(c1)C(F)(F)F)C(F)(F)F)c1ccccc1
InChI Key InChIKey=WJAFEJSYOHBPCK-SFHVURJKSA-N
Data  2 KI
  Tab Delimited (TSV)   2D SDfile   Computed 3D by Vconf -m prep SDfile
Find this compound or compounds like it in BindingDB:
Activity Spreadsheet -- Enzyme Inhibition Constant Data from BindingDB
Found 2 hits for monomerid = 50445805
TargetSubstance-P receptor(Homo sapiens (Human))
Universit£
Curated by ChEMBL
LigandPNGBDBM50445805(CHEMBL3104774)
Affinity DataKi:  251nM. Assay description: Displacement of [125I]-Bolton Hunter-Substance P from human NK1 receptor
In DepthDetails ArticlePubMed
TargetNeuromedin-K receptor(Homo sapiens (Human))
Universit£
Curated by ChEMBL
LigandPNGBDBM50445805(CHEMBL3104774)
Affinity DataKi:  1.00E+4nM. Assay description: Displacement of [3H]-SR142801 from human NK3 receptor
In DepthDetails ArticlePubMed