BDBM50446380 CHEMBL3109637
SMILES COc1cc2c(cc1OCCCN1CC[C@@H](F)C1)N=C(N)C21CCC1
InChI Key InChIKey=BDKDIFMYLGMBDI-CYBMUJFWSA-N
Data  1 IC50
  Tab Delimited (TSV)   2D SDfile   Computed 3D by Vconf -m prep SDfile
Find this compound or compounds like it in BindingDB:
Activity Spreadsheet -- Enzyme Inhibition Constant Data from BindingDB
Found 1 hit for monomerid = 50446380
TargetHistone-lysine N-methyltransferase EHMT2(Homo sapiens (Human))
Abbvie
Curated by ChEMBL
LigandPNGBDBM50446380(CHEMBL3109637)
Affinity DataIC50:  3.70nM. Assay description: Inhibition of G9a (unknown origin) using biotinylated-histone H3(1-21) peptide as substrate after 3 hrs by AlphaLISA assay
In DepthDetails ArticlePubMed