BDBM50446736 CHEMBL3114418
SMILES CCOCc1cccc(COCC)c1CN
InChI Key InChIKey=WRQFVIVPZHYFDR-UHFFFAOYSA-N
Data  2 IC50
  Tab Delimited (TSV)   2D SDfile   Computed 3D by Vconf -m prep SDfile
Find this compound or compounds like it in BindingDB:
Activity Spreadsheet -- Enzyme Inhibition Constant Data from BindingDB
Found 2 hits for monomerid = 50446736
TargetAmiloride-sensitive amine oxidase [copper-containing](Sus scrofa)
Universit£
Curated by ChEMBL
LigandPNGBDBM50446736(CHEMBL3114418)
Affinity DataIC50: >1.00E+6nM. Assay description: Inhibition of porcine kidney DAO using [1,4-14C]-putrescine as substrate preincubated for 30 mins followed by substrate addition
In DepthDetails ArticlePubMed
TargetProtein-lysine 6-oxidase(Sus scrofa)
Universit£
Curated by ChEMBL
LigandPNGBDBM50446736(CHEMBL3114418)
Affinity DataIC50: >1.00E+6nM. Assay description: Inhibition of porcine aorta lysyl oxidase preincubated for 30 mins followed by substrate addition
In DepthDetails ArticlePubMed