BDBM50446854 CHEMBL3115105
SMILES COC1COCCC1N[C@@H]1C[C@H]2CN(C[C@]2(C1)C(=O)N1CCc2ncc(cc2C1)C(F)(F)F)C(=O)OCC(C)C
InChI Key InChIKey=OFMVHBBUOMKBMH-BPPFZIAHSA-N
Data  2 IC50
  Tab Delimited (TSV)   2D SDfile   Computed 3D by Vconf -m prep SDfile
Find this compound or compounds like it in BindingDB:
Activity Spreadsheet -- Enzyme Inhibition Constant Data from BindingDB
Found 2 hits for monomerid = 50446854
TargetC-C chemokine receptor type 2(Homo sapiens (Human))
Janssen Research And Development
Curated by ChEMBL
LigandPNGBDBM50446854(CHEMBL3115105)
Affinity DataIC50:  35nM. Assay description: Binding affinity to CCR2 receptor (unknown origin)
In DepthDetails ArticlePubMed
TargetC-C chemokine receptor type 2(Homo sapiens (Human))
Janssen Research And Development
Curated by ChEMBL
LigandPNGBDBM50446854(CHEMBL3115105)
Affinity DataIC50:  21nM. Assay description: Antagonist activity at CCR2 receptor in human THP1 cells assessed as inhibition of MCP-1 induced chemotaxis after 3 hrs
In DepthDetails ArticlePubMed