BDBM50447068 CHEMBL3112683
SMILES Clc1ccc(cc1)S(=O)(=O)n1c(nc2ccccc12)C1CCCCC1
InChI Key InChIKey=RRECQKKYBHUEDJ-UHFFFAOYSA-N
Data  1 IC50
  Tab Delimited (TSV)   2D SDfile   Computed 3D by Vconf -m prep SDfile
Find this compound or compounds like it in BindingDB:
Activity Spreadsheet -- Enzyme Inhibition Constant Data from BindingDB
Found 1 hit for monomerid = 50447068
TargetAldehyde dehydrogenase, dimeric NADP-preferring(Homo sapiens (Human))
Indiana University School Of Medicine
Curated by ChEMBL
LigandPNGBDBM50447068(CHEMBL3112683)
Affinity DataIC50: >1.00E+5nM. Assay description: Inhibition of human ALDH3A1-mediated benzaldehyde oxidation preincubated for 1 min followed by substrate addition by spectrophotometric analysis
In DepthDetails ArticlePubMed