BDBM50447179 CHEMBL3113201::US10752581, Compound 71
SMILES Oc1c(Cl)cccc1CNc1ccc(cc1)S(=O)(=O)Nc1nc2ccccc2s1
InChI Key InChIKey=BHZKLCGNCPDCBF-UHFFFAOYSA-N
Data  4 IC50
  Tab Delimited (TSV)   2D SDfile   Computed 3D by Vconf -m prep SDfile
Find this compound or compounds like it in BindingDB:
Activity Spreadsheet -- Enzyme Inhibition Constant Data from BindingDB
Found 4 hits for monomerid = 50447179
TargetPolyunsaturated fatty acid lipoxygenase ALOX15(Homo sapiens (Human))
National Institutes Of Health
Curated by ChEMBL
LigandPNGBDBM50447179(CHEMBL3113201 | US10752581, Compound 71)
Affinity DataIC50:  1.30E+3nM. Assay description: Inhibition of N-terminal His6-tagged human reticulocyte 15-LOX1 using arachidonic acid as substrate by UV-vis spectrophotometric analysis
In DepthDetails ArticlePubMed
TargetPolyunsaturated fatty acid lipoxygenase ALOX15(Homo sapiens (Human))
National Institutes Of Health
Curated by ChEMBL
LigandPNGBDBM50447179(CHEMBL3113201 | US10752581, Compound 71)
Affinity DataIC50:  1.30E+3nM. Assay description: UV-vis cuvette-based assay.
In DepthDetails US Patent
TargetPolyunsaturated fatty acid lipoxygenase ALOX12(Homo sapiens (Human))
Eastern Virginia Medical School
US Patent
LigandPNGBDBM50447179(CHEMBL3113201 | US10752581, Compound 71)
Affinity DataIC50:  1.30E+3nM. Assay description: UV-vis cuvette-based assay.
In DepthDetails US Patent
TargetPolyunsaturated fatty acid lipoxygenase ALOX12(Homo sapiens (Human))
Eastern Virginia Medical School
US Patent
LigandPNGBDBM50447179(CHEMBL3113201 | US10752581, Compound 71)
Affinity DataIC50:  1.30E+3nM. Assay description: Inhibition of N-terminal His6-tagged human platelet 12-LOX using arachidonic acid as substrate by UV-vis spectrophotometric analysis
In DepthDetails ArticlePubMed