BDBM50447440 CHEMBL1363800
SMILES O=C(CCNS(=O)(=O)c1ccc2[nH]c(=O)oc2c1)NCc1ccccc1
InChI Key InChIKey=HAQYPUNVRUUGIP-UHFFFAOYSA-N
Data  3 IC50
  Tab Delimited (TSV)   2D SDfile   Computed 3D by Vconf -m prep SDfile
Find this compound or compounds like it in BindingDB:
Activity Spreadsheet -- Enzyme Inhibition Constant Data from BindingDB
Found 3 hits for monomerid = 50447440
TargetAlkaline phosphatase, placental type(Homo sapiens (Human))
Sanford-Burnham Medical Research Institute
Curated by ChEMBL
LigandPNGBDBM50447440(CHEMBL1363800)
Affinity DataIC50: >1.00E+5nM. Assay description: Inhibition of FLAG-tagged PLAP (unknown origin) expressed in African green monkey COS1 cells after 30 mins by chemiluminescence assay
In DepthDetails ArticlePubMed
TargetIntestinal-type alkaline phosphatase(Mus musculus)
Sanford-Burnham Medical Research Institute
Curated by ChEMBL
LigandPNGBDBM50447440(CHEMBL1363800)
Affinity DataIC50:  8.10E+4nM. Assay description: Inhibition of mouse duodenal-specific FLAG-tagged IAP expressed in African green monkey COS1 cells after 30 mins by chemiluminescence assay
In DepthDetails ArticlePubMed
TargetAlkaline phosphatase, tissue-nonspecific isozyme(Homo sapiens (Human))
Sanford-Burnham Medical Research Institute
Curated by ChEMBL
LigandPNGBDBM50447440(CHEMBL1363800)
Affinity DataIC50: >1.00E+5nM. Assay description: Inhibition of FLAG-tagged TNAP (unknown origin) expressed in African green monkey COS1 cells after 30 mins by chemiluminescence assay
In DepthDetails ArticlePubMed