BDBM50447992 CHEMBL3115199
SMILES OC[C@H]1O[C@H](O[C@H]2[C@H](O)[C@@H](O)[C@@H](CP(O)(O)=O)O[C@@H]2CO)[C@H](O)[C@@H](O)[C@@H]1O
InChI Key InChIKey=LIGBAXRYIYXSON-NVYKSAHZSA-N
Data  1 IC50
PDB links: 1 PDB ID matches this monomer.
  Tab Delimited (TSV)   2D SDfile   Computed 3D by Vconf -m prep SDfile
Find this compound or compounds like it in BindingDB:
Activity Spreadsheet -- Enzyme Inhibition Constant Data from BindingDB
Found 1 hit for monomerid = 50447992
TargetAlpha-1,4-glucan:maltose-1-phosphate maltosyltransferase(Mycobacterium tuberculosis (strain ATCC 25618 / H3...)
The University Of Toledo
Curated by ChEMBL
LigandPNGBDBM50447992(CHEMBL3115199)
Affinity DataIC50:  2.30E+5nM. Assay description: Inhibition of recombinant Mycobacterium tuberculosis H37Rv GlgE expressed in Escherichia coli BL21 (DE3) rosetta cells using maltose-1-phosphate as s...
In DepthDetails ArticlePubMed