BDBM50448376 Naphmethonium
SMILES CC(C)(CN1C(=O)c2cccc3cccc(C1=O)c23)C[N+](C)(C)CCCCCC[N+](C)(C)CCCN1C(=O)c2ccccc2C1=O
InChI Key InChIKey=JUFKZJDUYOXXML-UHFFFAOYSA-N
Data  1 IC50  1 EC50
  Tab Delimited (TSV)   2D SDfile   Computed 3D by Vconf -m prep SDfile
Find this compound or compounds like it in BindingDB:
Activity Spreadsheet -- Enzyme Inhibition Constant Data from BindingDB
Found 2 hits for monomerid = 50448376
TargetMuscarinic acetylcholine receptor M2(GUINEA PIG)
University Of W£Rzburg
Curated by ChEMBL
LigandPNGBDBM50448376(Naphmethonium)
Affinity DataEC50:  4.40nM. Assay description: Effective concentration required to inhibit dissociation of [3H]NMS from porcine heart ventricles muscarinic acetylcholine receptor M2.
Ligand InfoPC cidPC sid
In DepthDetails ArticlePubMed
TargetAcetylcholine receptor subunit epsilon(Rattus norvegicus)
Universit£
Curated by ChEMBL
LigandPNGBDBM50448376(Naphmethonium)
Affinity DataIC50:  4.17E+4nM. Assay description: Inhibition of acetylcholinesterase in rat brain homogenate after 15 mins by Ellman assay
Ligand InfoPC cidPC sid
In DepthDetails ArticlePubMed