BDBM504484 2-{5-[(3-Ethoxypyridin-2-yl)oxy]pyridin-3-yl}-N-[(3S,5S)-5-fluoropiperidin-3-yl]pyrimidine-5-carboxamide ::US11065249, Example 4::US11471458, Example 4::US20230405002, Example 4
SMILES CCOc1cccnc1Oc1cncc(c1)-c1ncc(cn1)C(=O)N[C@@H]1CNC[C@@H](F)C1
InChI Key InChIKey=CPBXJSPVZIPJMX-IRXDYDNUSA-N
Data  4 IC50
  Tab Delimited (TSV)   2D SDfile   Computed 3D by Vconf -m prep SDfile
Find this compound or compounds like it in BindingDB:
Activity Spreadsheet -- Enzyme Inhibition Constant Data from BindingDB
Found 4 hits for monomerid = 504484
TargetDiacylglycerol O-acyltransferase 2(Homo sapiens (Human))
Pfizer
US Patent
LigandPNGBDBM504484(2-{5-[(3-Ethoxypyridin-2-yl)oxy]pyridin-3-yl}-N-[(...)
Affinity DataIC50:  10nM. Assay description: For determination of IC50 values, the reactions were carried out in 384-well white polypropylene plates (Nunc) in a total volume of 20 μL. To 1 ...
Ligand InfoPC cidPC sid
In DepthDetails US Patent
TargetDiacylglycerol O-acyltransferase 2(Homo sapiens (Human))
Pfizer
US Patent
LigandPNGBDBM504484(2-{5-[(3-Ethoxypyridin-2-yl)oxy]pyridin-3-yl}-N-[(...)
Affinity DataIC50:  10nM. Assay description: For determination of IC50 values, the reactions were carried out in 384-well white polypropylene plates (Nunc) in a total volume of 20 μL. To 1 ...
Ligand InfoPC cidPC sid
In DepthDetails US Patent
TargetDiacylglycerol O-acyltransferase 2(Homo sapiens (Human))
Pfizer
US Patent
LigandPNGBDBM504484(2-{5-[(3-Ethoxypyridin-2-yl)oxy]pyridin-3-yl}-N-[(...)
Affinity DataIC50:  11nM. Assay description: Inhibition of DGAT2 in human hepatocytes using [14C]-glycerol as substrate preincubated for 15 mins followed by substrate addition and measured after...
Ligand InfoPC cidPC sid
In DepthDetails ArticlePubMed
TargetDiacylglycerol O-acyltransferase 2(Homo sapiens (Human))
Pfizer
US Patent
LigandPNGBDBM504484(2-{5-[(3-Ethoxypyridin-2-yl)oxy]pyridin-3-yl}-N-[(...)
Affinity DataIC50:  10nM. Assay description: For determination of IC50 values, the reactions were carried out in 384-well white polypropylene plates (Nunc) in a total volume of 20 μL. To 1 ...
Ligand InfoPC cidPC sid
In DepthDetails US Patent