BDBM50448834 CHEMBL3128247
SMILES CCN(CCc1ccc(cc1)N=C(N)c1cccs1)Cc1cccc(NC(=N)c2cccs2)c1
InChI Key InChIKey=ZAOJVZLLICOZMJ-UHFFFAOYSA-N
Data  3 KI
  Tab Delimited (TSV)   2D SDfile   Computed 3D by Vconf -m prep SDfile
Find this compound or compounds like it in BindingDB:
Activity Spreadsheet -- Enzyme Inhibition Constant Data from BindingDB
Found 3 hits for monomerid = 50448834
TargetNitric oxide synthase, brain(Rattus norvegicus (rat))
Northwestern University
Curated by ChEMBL
LigandPNGBDBM50448834(CHEMBL3128247)
Affinity DataKi:  49nM. Assay description: Inhibition of recombinant rat nNOS overexpressed in Escherichia coli using L-arginine as substrate assessed as nitric oxide formation measured for 60...
In DepthDetails ArticlePubMed
TargetNitric oxide synthase, inducible(Mus musculus (mouse))
Northwestern University
Curated by ChEMBL
LigandPNGBDBM50448834(CHEMBL3128247)
Affinity DataKi:  1.42E+4nM. Assay description: Inhibition of recombinant mouse iNOS overexpressed in Escherichia coli using L-arginine as substrate assessed as nitric oxide formation measured for ...
In DepthDetails ArticlePubMed
TargetNitric oxide synthase, endothelial(Bos taurus (bovine))
Northwestern University
Curated by ChEMBL
LigandPNGBDBM50448834(CHEMBL3128247)
Affinity DataKi:  4.14E+4nM. Assay description: Inhibition of recombinant bovine eNOS overexpressed in Escherichia coli using L-arginine as substrate assessed as nitric oxide formation measured for...
In DepthDetails ArticlePubMed