BDBM504495 First-eluting isomer (see footnote 4 in Table 1); rac-2-{5-[(3-ethoxypyridin-2- yl)oxy]pyridin-3-yl}-N-[(3R,6S)-6- (trifluoromethyl)piperidin-3- yl]pyrimidine-5-carboxamide or rac-2-{5-[(3-ethoxypyridin-2- yl)oxy]pyridin-3-yl}-N-[(3R,6R)-6- (trifluoromethyl)piperidin-3- yl]pyrimidine-5-carboxamide::US11065249, Example 8::US11065249, Example 9::US11471458, Example 9::US20230405002, Example 11
SMILES CCOc1cccnc1Oc1cncc(c1)-c1ncc(cn1)C(=O)N[C@H]1CC[C@@H](NC1)C(F)(F)F
InChI Key InChIKey=PYMOGDZRMJREBT-QFBILLFUSA-N
Data  6 IC50
  Tab Delimited (TSV)   2D SDfile   Computed 3D by Vconf -m prep SDfile
Find this compound or compounds like it in BindingDB:
Activity Spreadsheet -- Enzyme Inhibition Constant Data from BindingDB
Found 6 hits for monomerid = 504495
TargetDiacylglycerol O-acyltransferase 2(Homo sapiens (Human))
Pfizer
US Patent
LigandPNGBDBM504495(First-eluting isomer (see footnote 4 in Table 1); ...)
Affinity DataIC50:  650nM. Assay description: For determination of IC50 values, the reactions were carried out in 384-well white polypropylene plates (Nunc) in a total volume of 20 μL. To 1 ...
Ligand InfoPC cidPC sid
In DepthDetails US Patent
TargetDiacylglycerol O-acyltransferase 2(Homo sapiens (Human))
Pfizer
US Patent
LigandPNGBDBM504495(First-eluting isomer (see footnote 4 in Table 1); ...)
Affinity DataIC50:  19nM. Assay description: For determination of IC50 values, the reactions were carried out in 384-well white polypropylene plates (Nunc) in a total volume of 20 μL. To 1 ...
Ligand InfoPC cidPC sid
In DepthDetails US Patent
TargetDiacylglycerol O-acyltransferase 2(Homo sapiens (Human))
Pfizer
US Patent
LigandPNGBDBM504495(First-eluting isomer (see footnote 4 in Table 1); ...)
Affinity DataIC50:  4.40nM. Assay description: For determination of IC50 values, the reactions were carried out in 384-well white polypropylene plates (Nunc) in a total volume of 20 μL. To 1 ...
Ligand InfoPC cidPC sid
In DepthDetails US Patent
TargetDiacylglycerol O-acyltransferase 2(Homo sapiens (Human))
Pfizer
US Patent
LigandPNGBDBM504495(First-eluting isomer (see footnote 4 in Table 1); ...)
Affinity DataIC50:  19nM. Assay description: For determination of IC50 values, the reactions were carried out in 384-well white polypropylene plates (Nunc) in a total volume of 20 μL. To 1 ...
Ligand InfoPC cidPC sid
In DepthDetails US Patent
TargetDiacylglycerol O-acyltransferase 2(Homo sapiens (Human))
Pfizer
US Patent
LigandPNGBDBM504495(First-eluting isomer (see footnote 4 in Table 1); ...)
Affinity DataIC50:  650nM. Assay description: For determination of IC50 values, the reactions were carried out in 384-well white polypropylene plates (Nunc) in a total volume of 20 μL. To 1 ...
Ligand InfoPC cidPC sid
In DepthDetails US Patent
TargetDiacylglycerol O-acyltransferase 2(Homo sapiens (Human))
Pfizer
US Patent
LigandPNGBDBM504495(First-eluting isomer (see footnote 4 in Table 1); ...)
Affinity DataIC50:  650nM. Assay description: For determination of IC50 values, the reactions were carried out in 384-well white polypropylene plates (Nunc) in a total volume of 20 μL. To 1 ...
Ligand InfoPC cidPC sid
In DepthDetails US Patent