BDBM50450731 CHEMBL96733
SMILES Brc1cncc(OC[C@@H]2CCN2)c1
InChI Key InChIKey=RXDAKJWSDOQUGH-QMMMGPOBSA-N
Data  2 KI
  Tab Delimited (TSV)   2D SDfile   Computed 3D by Vconf -m prep SDfile
Find this compound or compounds like it in BindingDB:
Activity Spreadsheet -- Enzyme Inhibition Constant Data from BindingDB
Found 2 hits for monomerid = 50450731
TargetNeuronal acetylcholine receptor subunit alpha-4/beta-2(Rattus norvegicus (Rat))
National Institute On Drug Abuse
Curated by ChEMBL
LigandPNGBDBM50450731(CHEMBL96733)
Affinity DataKi:  0.0210nM. Assay description: Binding affinity for alpha4 beta-2 nAChR using [3H]epibatidine in rat brain
In DepthDetails ArticlePubMed
TargetNeuronal acetylcholine receptor subunit alpha-4/beta-2(Rattus norvegicus (Rat))
National Institute On Drug Abuse
Curated by ChEMBL
LigandPNGBDBM50450731(CHEMBL96733)
Affinity DataKi:  0.180nM. Assay description: Binding affinity towards Nicotinic acetylcholine receptor alpha4-beta2 in rat brain using [3H]-cytisine as radioligand
In DepthDetails ArticlePubMed