BDBM50450911 CHEMBL4218889
SMILES Oc1ccc(\C=C(/C#N)c2nc3ccccc3s2)c(O)c1
InChI Key InChIKey=DUANVZFOXHANPF-YRNVUSSQSA-N
Data  1 IC50
  Tab Delimited (TSV)   2D SDfile   Computed 3D by Vconf -m prep SDfile
Find this compound or compounds like it in BindingDB:
Activity Spreadsheet -- Enzyme Inhibition Constant Data from BindingDB
Found 1 hit for monomerid = 50450911
TargetProbable L-lysine-epsilon aminotransferase(Mycobacterium tuberculosis (strain ATCC 25618 / H3...)
Birla Institute Of Technology & Science-Pilani
Curated by ChEMBL
LigandPNGBDBM50450911(CHEMBL4218889)
Affinity DataIC50:  2.32E+4nM. Assay description: Inhibition of Mycobacterium tuberculosis LAT using L-lysine as substrate by spectroscopic method
In DepthDetails ArticlePubMed