BDBM504512 US11065249, Example 25::US11471458, Example 25::rac-2-{5-[(3-ethoxypyridin-2- yl)oxy]pyridin-3-yl}-N-[(3R,5S)-5- fluoropiperidin-3-yl]pyrimidine-5- carboxamide, trifluoroacetate salt
SMILES CCOc1cccnc1Oc1cncc(c1)-c1ncc(cn1)C(=O)N[C@H]1CNC[C@@H](F)C1
InChI Key InChIKey=RTJSFNSXPOCCRB-DLBZAZTESA-N
Data  2 IC50
  Tab Delimited (TSV)   2D SDfile   Computed 3D by Vconf -m prep SDfile
Find this compound or compounds like it in BindingDB:
Activity Spreadsheet -- Enzyme Inhibition Constant Data from BindingDB
Found 2 hits for monomerid = 504512
TargetDiacylglycerol O-acyltransferase 2(Homo sapiens (Human))
Pfizer
US Patent
LigandPNGBDBM504512(US11065249, Example 25 | US11471458, Example 25 | ...)
Affinity DataIC50:  200nM. Assay description: For determination of IC50 values, the reactions were carried out in 384-well white polypropylene plates (Nunc) in a total volume of 20 μL. To 1 ...
Ligand InfoPC cidPC sid
In DepthDetails US Patent
TargetDiacylglycerol O-acyltransferase 2(Homo sapiens (Human))
Pfizer
US Patent
LigandPNGBDBM504512(US11065249, Example 25 | US11471458, Example 25 | ...)
Affinity DataIC50:  200nM. Assay description: For determination of IC50 values, the reactions were carried out in 384-well white polypropylene plates (Nunc) in a total volume of 20 μL. To 1 ...
Ligand InfoPC cidPC sid
In DepthDetails US Patent