BDBM50451997 CHEMBL608340
SMILES Cn1ccnc1SC[C@H]1OC([C@H](O)[C@@H]1O)n1cnc2c(NC3CCOC3)ncnc12
InChI Key InChIKey=MUQDCKYJVFVKKT-MQWPZHSDSA-N
Data  1 KI
  Tab Delimited (TSV)   2D SDfile   Computed 3D by Vconf -m prep SDfile
Find this compound or compounds like it in BindingDB:
Activity Spreadsheet -- Enzyme Inhibition Constant Data from BindingDB
Found 1 hit for monomerid = 50451997
TargetAdenosine receptor A1(GUINEA PIG)
Cv Therapeutics
Curated by ChEMBL
LigandPNGBDBM50451997(CHEMBL608340)
Affinity DataKi:  4.19E+3nM. Assay description: Binding affinity against adenosine A1 receptor using [3H]-CPX in guinea pig DDT membrane; 4191+/-922
In DepthDetails ArticlePubMed